Unable to build zeppelin from git.

classic Classic list List threaded Threaded
3 messages Options
Reply | Threaded
Open this post in threaded view
|

Unable to build zeppelin from git.

ÐΞ€ρ@Ҝ (๏̯͡๏)
Steps

git clone https://github.com/apache/incubator-zeppelin.git

mvn clean package -Pspark-1.4 -Dspark.version=1.4.1 -Dhadoop.version=2.7.0 -Phadoop-2.6 -Pyarn -DskipTests


$ java -version

java version "1.7.0_79"

Java(TM) SE Runtime Environment (build 1.7.0_79-b15)

Java HotSpot(TM) 64-Bit Server VM (build 24.79-b02, mixed mode)

LM-SJL-00877532:incubator-zeppelin dvasthimal$ mvn -version

Apache Maven 3.1.0 (893ca28a1da9d5f51ac03827af98bb730128f9f2; 2013-06-27 19:15:32-0700)

Maven home: /Users/dvasthimal/ebay/softwares/apache-maven-3.1.0

Java version: 1.7.0_79, vendor: Oracle Corporation

Java home: /Library/Java/JavaVirtualMachines/jdk1.7.0_79.jdk/Contents/Home/jre

Default locale: en_US, platform encoding: UTF-8

OS name: "mac os x", version: "10.10.5", arch: "x86_64", family: "mac"

LM-SJL-00877532:incubator-zeppelin dvasthimal$ 




Failing at 

[INFO] Zeppelin: web Application ......................... FAILURE [1:35.981s]

Detail

====

[ERROR] npm ERR! System Darwin 14.5.0

[ERROR] npm ERR! command "/Users/dvasthimal/ebay/projects/poc/zeppelin/incubator-zeppelin/zeppelin-web/node/node" "/Users/dvasthimal/ebay/projects/poc/zeppelin/incubator-zeppelin/zeppelin-web/node/npm/bin/npm-cli.js" "install" "--color=false"

[ERROR] npm ERR! cwd /Users/dvasthimal/ebay/projects/poc/zeppelin/incubator-zeppelin/zeppelin-web

[ERROR] npm ERR! node -v v0.10.18

[ERROR] npm ERR! npm -v 1.3.8

[ERROR] npm ERR! path /var/folders/0v/446flf5d3gddq7tnhljk15pc3910pj/T/npm-8855-zwntX2aj/1443205576592-0.34037690539844334/package/test/fixture/multi_video.upload

[ERROR] npm ERR! fstream_path /var/folders/0v/446flf5d3gddq7tnhljk15pc3910pj/T/npm-8855-zwntX2aj/1443205576592-0.34037690539844334/package/test/fixture/multi_video.upload

[ERROR] npm ERR! fstream_type File

[ERROR] npm ERR! fstream_class FileWriter

[ERROR] npm ERR! code ENOENT

[ERROR] npm ERR! errno 34

[ERROR] npm ERR! fstream_stack /Users/dvasthimal/ebay/projects/poc/zeppelin/incubator-zeppelin/zeppelin-web/node/npm/node_modules/fstream/lib/writer.js:284:26

[ERROR] npm ERR! fstream_stack Object.oncomplete (fs.js:107:15)

[ERROR] npm ERR! 

[ERROR] npm ERR! Additional logging details can be found in:

[ERROR] npm ERR!     /Users/dvasthimal/ebay/projects/poc/zeppelin/incubator-zeppelin/zeppelin-web/npm-debug.log

[ERROR] npm ERR! not ok code 0

[INFO] ------------------------------------------------------------------------

[INFO] Reactor Summary:

[INFO] 

[INFO] Zeppelin .......................................... SUCCESS [2.630s]

[INFO] Zeppelin: Interpreter ............................. SUCCESS [3.547s]

[INFO] Zeppelin: Zengine ................................. SUCCESS [1.017s]

[INFO] Zeppelin: Spark dependencies ...................... SUCCESS [25.865s]

[INFO] Zeppelin: Spark ................................... SUCCESS [19.750s]

[INFO] Zeppelin: Markdown interpreter .................... SUCCESS [0.331s]

[INFO] Zeppelin: Angular interpreter ..................... SUCCESS [0.179s]

[INFO] Zeppelin: Shell interpreter ....................... SUCCESS [0.204s]

[INFO] Zeppelin: Hive interpreter ........................ SUCCESS [1.323s]

[INFO] Zeppelin: Apache Phoenix Interpreter .............. SUCCESS [3.188s]

[INFO] Zeppelin: Apache Geode interpreter ................ SUCCESS [7.728s]

[INFO] Zeppelin: PostgreSQL interpreter .................. SUCCESS [0.345s]

[INFO] Zeppelin: Tajo interpreter ........................ SUCCESS [0.453s]

[INFO] Zeppelin: Flink ................................... SUCCESS [5.516s]

[INFO] Zeppelin: Apache Ignite interpreter ............... SUCCESS [0.640s]

[INFO] Zeppelin: Kylin interpreter ....................... SUCCESS [0.246s]

[INFO] Zeppelin: Lens interpreter ........................ SUCCESS [1.228s]

[INFO] Zeppelin: Cassandra ............................... SUCCESS [32.101s]

[INFO] Zeppelin: web Application ......................... FAILURE [1:35.981s]

[INFO] Zeppelin: Server .................................. SKIPPED

[INFO] Zeppelin: Packaging distribution .................. SKIPPED

[INFO] ------------------------------------------------------------------------

[INFO] BUILD FAILURE

[INFO] ------------------------------------------------------------------------

[INFO] Total time: 3:22.607s

[INFO] Finished at: Fri Sep 25 11:27:28 PDT 2015

[INFO] Final Memory: 162M/1674M

[INFO] ------------------------------------------------------------------------

[ERROR] Failed to execute goal com.github.eirslett:frontend-maven-plugin:0.0.23:npm (npm install) on project zeppelin-web: Failed to run task: 'npm install --color=false' failed. (error code 1) -> [Help 1]

[ERROR] 



--
Deepak

Reply | Threaded
Open this post in threaded view
|

Re: Unable to build zeppelin from git.

Corneau Damien

What OS are you using?
Verdion of Maven?
NodeJs installed?

On Sep 26, 2015 3:33 AM, "ÐΞ€ρ@Ҝ (๏̯͡๏)" <[hidden email]> wrote:
Steps

git clone https://github.com/apache/incubator-zeppelin.git

mvn clean package -Pspark-1.4 -Dspark.version=1.4.1 -Dhadoop.version=2.7.0 -Phadoop-2.6 -Pyarn -DskipTests


$ java -version

java version "1.7.0_79"

Java(TM) SE Runtime Environment (build 1.7.0_79-b15)

Java HotSpot(TM) 64-Bit Server VM (build 24.79-b02, mixed mode)

LM-SJL-00877532:incubator-zeppelin dvasthimal$ mvn -version

Apache Maven 3.1.0 (893ca28a1da9d5f51ac03827af98bb730128f9f2; 2013-06-27 19:15:32-0700)

Maven home: /Users/dvasthimal/ebay/softwares/apache-maven-3.1.0

Java version: 1.7.0_79, vendor: Oracle Corporation

Java home: /Library/Java/JavaVirtualMachines/jdk1.7.0_79.jdk/Contents/Home/jre

Default locale: en_US, platform encoding: UTF-8

OS name: "mac os x", version: "10.10.5", arch: "x86_64", family: "mac"

LM-SJL-00877532:incubator-zeppelin dvasthimal$ 




Failing at 

[INFO] Zeppelin: web Application ......................... FAILURE [1:35.981s]

Detail

====

[ERROR] npm ERR! System Darwin 14.5.0

[ERROR] npm ERR! command "/Users/dvasthimal/ebay/projects/poc/zeppelin/incubator-zeppelin/zeppelin-web/node/node" "/Users/dvasthimal/ebay/projects/poc/zeppelin/incubator-zeppelin/zeppelin-web/node/npm/bin/npm-cli.js" "install" "--color=false"

[ERROR] npm ERR! cwd /Users/dvasthimal/ebay/projects/poc/zeppelin/incubator-zeppelin/zeppelin-web

[ERROR] npm ERR! node -v v0.10.18

[ERROR] npm ERR! npm -v 1.3.8

[ERROR] npm ERR! path /var/folders/0v/446flf5d3gddq7tnhljk15pc3910pj/T/npm-8855-zwntX2aj/1443205576592-0.34037690539844334/package/test/fixture/multi_video.upload

[ERROR] npm ERR! fstream_path /var/folders/0v/446flf5d3gddq7tnhljk15pc3910pj/T/npm-8855-zwntX2aj/1443205576592-0.34037690539844334/package/test/fixture/multi_video.upload

[ERROR] npm ERR! fstream_type File

[ERROR] npm ERR! fstream_class FileWriter

[ERROR] npm ERR! code ENOENT

[ERROR] npm ERR! errno 34

[ERROR] npm ERR! fstream_stack /Users/dvasthimal/ebay/projects/poc/zeppelin/incubator-zeppelin/zeppelin-web/node/npm/node_modules/fstream/lib/writer.js:284:26

[ERROR] npm ERR! fstream_stack Object.oncomplete (fs.js:107:15)

[ERROR] npm ERR! 

[ERROR] npm ERR! Additional logging details can be found in:

[ERROR] npm ERR!     /Users/dvasthimal/ebay/projects/poc/zeppelin/incubator-zeppelin/zeppelin-web/npm-debug.log

[ERROR] npm ERR! not ok code 0

[INFO] ------------------------------------------------------------------------

[INFO] Reactor Summary:

[INFO] 

[INFO] Zeppelin .......................................... SUCCESS [2.630s]

[INFO] Zeppelin: Interpreter ............................. SUCCESS [3.547s]

[INFO] Zeppelin: Zengine ................................. SUCCESS [1.017s]

[INFO] Zeppelin: Spark dependencies ...................... SUCCESS [25.865s]

[INFO] Zeppelin: Spark ................................... SUCCESS [19.750s]

[INFO] Zeppelin: Markdown interpreter .................... SUCCESS [0.331s]

[INFO] Zeppelin: Angular interpreter ..................... SUCCESS [0.179s]

[INFO] Zeppelin: Shell interpreter ....................... SUCCESS [0.204s]

[INFO] Zeppelin: Hive interpreter ........................ SUCCESS [1.323s]

[INFO] Zeppelin: Apache Phoenix Interpreter .............. SUCCESS [3.188s]

[INFO] Zeppelin: Apache Geode interpreter ................ SUCCESS [7.728s]

[INFO] Zeppelin: PostgreSQL interpreter .................. SUCCESS [0.345s]

[INFO] Zeppelin: Tajo interpreter ........................ SUCCESS [0.453s]

[INFO] Zeppelin: Flink ................................... SUCCESS [5.516s]

[INFO] Zeppelin: Apache Ignite interpreter ............... SUCCESS [0.640s]

[INFO] Zeppelin: Kylin interpreter ....................... SUCCESS [0.246s]

[INFO] Zeppelin: Lens interpreter ........................ SUCCESS [1.228s]

[INFO] Zeppelin: Cassandra ............................... SUCCESS [32.101s]

[INFO] Zeppelin: web Application ......................... FAILURE [1:35.981s]

[INFO] Zeppelin: Server .................................. SKIPPED

[INFO] Zeppelin: Packaging distribution .................. SKIPPED

[INFO] ------------------------------------------------------------------------

[INFO] BUILD FAILURE

[INFO] ------------------------------------------------------------------------

[INFO] Total time: 3:22.607s

[INFO] Finished at: Fri Sep 25 11:27:28 PDT 2015

[INFO] Final Memory: 162M/1674M

[INFO] ------------------------------------------------------------------------

[ERROR] Failed to execute goal com.github.eirslett:frontend-maven-plugin:0.0.23:npm (npm install) on project zeppelin-web: Failed to run task: 'npm install --color=false' failed. (error code 1) -> [Help 1]

[ERROR] 



--
Deepak

Reply | Threaded
Open this post in threaded view
|

Re: Unable to build zeppelin from git.

Corneau Damien

Seems its a problem with NodeJs.
You should have logs here: /Users/dvasthimal/ebay/projects/poc/zeppelin/incubator-zeppelin/zeppelin-web/npm-debug.log

You can also try to run 'npm install' in zeppelin-web repository to pinpoint what is wrong

On Sep 26, 2015 8:50 AM, "Corneau Damien" <[hidden email]> wrote:

What OS are you using?
Verdion of Maven?
NodeJs installed?

On Sep 26, 2015 3:33 AM, "ÐΞ€ρ@Ҝ (๏̯͡๏)" <[hidden email]> wrote:
Steps

git clone https://github.com/apache/incubator-zeppelin.git

mvn clean package -Pspark-1.4 -Dspark.version=1.4.1 -Dhadoop.version=2.7.0 -Phadoop-2.6 -Pyarn -DskipTests


$ java -version

java version "1.7.0_79"

Java(TM) SE Runtime Environment (build 1.7.0_79-b15)

Java HotSpot(TM) 64-Bit Server VM (build 24.79-b02, mixed mode)

LM-SJL-00877532:incubator-zeppelin dvasthimal$ mvn -version

Apache Maven 3.1.0 (893ca28a1da9d5f51ac03827af98bb730128f9f2; 2013-06-27 19:15:32-0700)

Maven home: /Users/dvasthimal/ebay/softwares/apache-maven-3.1.0

Java version: 1.7.0_79, vendor: Oracle Corporation

Java home: /Library/Java/JavaVirtualMachines/jdk1.7.0_79.jdk/Contents/Home/jre

Default locale: en_US, platform encoding: UTF-8

OS name: "mac os x", version: "10.10.5", arch: "x86_64", family: "mac"

LM-SJL-00877532:incubator-zeppelin dvasthimal$ 




Failing at 

[INFO] Zeppelin: web Application ......................... FAILURE [1:35.981s]

Detail

====

[ERROR] npm ERR! System Darwin 14.5.0

[ERROR] npm ERR! command "/Users/dvasthimal/ebay/projects/poc/zeppelin/incubator-zeppelin/zeppelin-web/node/node" "/Users/dvasthimal/ebay/projects/poc/zeppelin/incubator-zeppelin/zeppelin-web/node/npm/bin/npm-cli.js" "install" "--color=false"

[ERROR] npm ERR! cwd /Users/dvasthimal/ebay/projects/poc/zeppelin/incubator-zeppelin/zeppelin-web

[ERROR] npm ERR! node -v v0.10.18

[ERROR] npm ERR! npm -v 1.3.8

[ERROR] npm ERR! path /var/folders/0v/446flf5d3gddq7tnhljk15pc3910pj/T/npm-8855-zwntX2aj/1443205576592-0.34037690539844334/package/test/fixture/multi_video.upload

[ERROR] npm ERR! fstream_path /var/folders/0v/446flf5d3gddq7tnhljk15pc3910pj/T/npm-8855-zwntX2aj/1443205576592-0.34037690539844334/package/test/fixture/multi_video.upload

[ERROR] npm ERR! fstream_type File

[ERROR] npm ERR! fstream_class FileWriter

[ERROR] npm ERR! code ENOENT

[ERROR] npm ERR! errno 34

[ERROR] npm ERR! fstream_stack /Users/dvasthimal/ebay/projects/poc/zeppelin/incubator-zeppelin/zeppelin-web/node/npm/node_modules/fstream/lib/writer.js:284:26

[ERROR] npm ERR! fstream_stack Object.oncomplete (fs.js:107:15)

[ERROR] npm ERR! 

[ERROR] npm ERR! Additional logging details can be found in:

[ERROR] npm ERR!     /Users/dvasthimal/ebay/projects/poc/zeppelin/incubator-zeppelin/zeppelin-web/npm-debug.log

[ERROR] npm ERR! not ok code 0

[INFO] ------------------------------------------------------------------------

[INFO] Reactor Summary:

[INFO] 

[INFO] Zeppelin .......................................... SUCCESS [2.630s]

[INFO] Zeppelin: Interpreter ............................. SUCCESS [3.547s]

[INFO] Zeppelin: Zengine ................................. SUCCESS [1.017s]

[INFO] Zeppelin: Spark dependencies ...................... SUCCESS [25.865s]

[INFO] Zeppelin: Spark ................................... SUCCESS [19.750s]

[INFO] Zeppelin: Markdown interpreter .................... SUCCESS [0.331s]

[INFO] Zeppelin: Angular interpreter ..................... SUCCESS [0.179s]

[INFO] Zeppelin: Shell interpreter ....................... SUCCESS [0.204s]

[INFO] Zeppelin: Hive interpreter ........................ SUCCESS [1.323s]

[INFO] Zeppelin: Apache Phoenix Interpreter .............. SUCCESS [3.188s]

[INFO] Zeppelin: Apache Geode interpreter ................ SUCCESS [7.728s]

[INFO] Zeppelin: PostgreSQL interpreter .................. SUCCESS [0.345s]

[INFO] Zeppelin: Tajo interpreter ........................ SUCCESS [0.453s]

[INFO] Zeppelin: Flink ................................... SUCCESS [5.516s]

[INFO] Zeppelin: Apache Ignite interpreter ............... SUCCESS [0.640s]

[INFO] Zeppelin: Kylin interpreter ....................... SUCCESS [0.246s]

[INFO] Zeppelin: Lens interpreter ........................ SUCCESS [1.228s]

[INFO] Zeppelin: Cassandra ............................... SUCCESS [32.101s]

[INFO] Zeppelin: web Application ......................... FAILURE [1:35.981s]

[INFO] Zeppelin: Server .................................. SKIPPED

[INFO] Zeppelin: Packaging distribution .................. SKIPPED

[INFO] ------------------------------------------------------------------------

[INFO] BUILD FAILURE

[INFO] ------------------------------------------------------------------------

[INFO] Total time: 3:22.607s

[INFO] Finished at: Fri Sep 25 11:27:28 PDT 2015

[INFO] Final Memory: 162M/1674M

[INFO] ------------------------------------------------------------------------

[ERROR] Failed to execute goal com.github.eirslett:frontend-maven-plugin:0.0.23:npm (npm install) on project zeppelin-web: Failed to run task: 'npm install --color=false' failed. (error code 1) -> [Help 1]

[ERROR] 



--
Deepak